Reaction Details
TargetCannabinoid receptor 1
LigandBDBM50267486
Substrate/Competitorn/a
Meas. Tech.ChEMBL_563053 (CHEMBL1011883)
EC50 1±n/a nM
Citation Vachal, PFletcher, JMFong, TMHuang, CCLao, JXiao, JCShen, CPStrack, AMShearman, LStribling, SChen, RZFrassetto, ATong, XWang, JBall, RGTsou, NNHickey, GJThompson, DFFaidley, TDNicolich, SAchanfuo-Yeboah, JHora, DFHale, JJHagmann, WK 1-Sulfonyl-4-acylpiperazines as selective cannabinoid-1 receptor (CB1R) inverse agonists for the treatment of obesity. J Med Chem52:2550-8 (2009) 
 
Cannabinoid receptor 1
Name:Cannabinoid receptor 1
Type:G Protein-Coupled Receptor (GPCR)
Mol. Mass.:52868.96
Organism:Homo sapiens (Human)
Description:P21554
Residue:472
BDBM50267486
NameBDBM50267486
Synonyms:CHEMBL478696 | methyl 3-(trifluoromethyl)-5-(4-(2-(4-(trifluoromethyl)phenyl)acetyl)piperazin-1-ylsulfonyl)benzoate
TypeSmall organic molecule
Emp. Form.C22H20F6N2O5S
Mol. Mass.538.46
SMILESCOC(=O)c1cc(cc(c1)S(=O)(=O)N1CCN(CC1)C(=O)Cc1ccc(cc1)C(F)(F)F)C(F)(F)F