Reaction Details
TargetPotassium voltage-gated channel subfamily H member 2
LigandBDBM50267873
Substrate/Competitorn/a
Meas. Tech.ChEMBL_563071 (CHEMBL1011901)
IC50 4000±n/a nM
Citation Vachal, PFletcher, JMFong, TMHuang, CCLao, JXiao, JCShen, CPStrack, AMShearman, LStribling, SChen, RZFrassetto, ATong, XWang, JBall, RGTsou, NNHickey, GJThompson, DFFaidley, TDNicolich, SAchanfuo-Yeboah, JHora, DFHale, JJHagmann, WK 1-Sulfonyl-4-acylpiperazines as selective cannabinoid-1 receptor (CB1R) inverse agonists for the treatment of obesity. J Med Chem52:2550-8 (2009) 
 
Potassium voltage-gated channel subfamily H member 2
Name:Potassium voltage-gated channel subfamily H member 2
Type:Multi-pass membrane protein
Mol. Mass.:126672.65
Organism:Homo sapiens (Human)
Description:Q12809
Residue:1159
BDBM50267873
NameBDBM50267873
Synonyms:2-(3-(trifluoromethyl)-5-(4-((1R,2R)-2-(4-(trifluoromethyl)phenyl)cyclopropanecarbonyl)piperazin-1-ylsulfonyl)phenyl)thiazol-4(5H)-one | CHEMBL529214
TypeSmall organic molecule
Emp. Form.C25H21F6N3O4S2
Mol. Mass.605.572
SMILESOc1csc(n1)-c1cc(cc(c1)S(=O)(=O)N1CCN(CC1)C(=O)[C@@H]1C[C@H]1c1ccc(cc1)C(F)(F)F)C(F)(F)F