Reaction Details
Target5-hydroxytryptamine receptor 7
LigandBDBM50267696
Substrate/Competitorn/a
Meas. Tech.ChEMBL_563397 (CHEMBL959382)
Ki 63±n/a nM
Citation Medina, RASallander, JBenhamú, BPorras, ECampillo, MPardo, LLópez-Rodríguez, ML Synthesis of new serotonin 5-HT7 receptor ligands. Determinants of 5-HT7/5-HT1A receptor selectivity. J Med Chem52:2384-92 (2009) 
 
5-hydroxytryptamine receptor 7
Name:5-hydroxytryptamine receptor 7
Type:G Protein-Coupled Receptor (GPCR)
Mol. Mass.:53573.08
Organism:Homo sapiens (Human)
Description:P34969
Residue:479
BDBM50267696
NameBDBM50267696
Synonyms:1-{5-[4-(2-Methoxyphenyl)piperazin-1-yl]pentyl}-1,3-dihydro-2H-indol-2-one | CHEMBL522417
TypeSmall organic molecule
Emp. Form.C24H31N3O2
Mol. Mass.393.5218
SMILESCOc1ccccc1N1CCN(CCCCCN2C(=O)Cc3ccccc23)CC1