Reaction Details
Target5-hydroxytryptamine receptor 7
LigandBDBM50267737
Substrate/Competitorn/a
Meas. Tech.ChEMBL_563397 (CHEMBL959382)
Ki 69±n/a nM
Citation Medina, RASallander, JBenhamú, BPorras, ECampillo, MPardo, LLópez-Rodríguez, ML Synthesis of new serotonin 5-HT7 receptor ligands. Determinants of 5-HT7/5-HT1A receptor selectivity. J Med Chem52:2384-92 (2009) 
 
5-hydroxytryptamine receptor 7
Name:5-hydroxytryptamine receptor 7
Type:G Protein-Coupled Receptor (GPCR)
Mol. Mass.:53573.08
Organism:Homo sapiens (Human)
Description:P34969
Residue:479
BDBM50267737
NameBDBM50267737
Synonyms:1-{5-[4-(1-Naphthyl)piperazin-1-yl]pentyl}-1,3-dihydro-2H-indol-2-one | CHEMBL506875
TypeSmall organic molecule
Emp. Form.C27H31N3O
Mol. Mass.413.5545
SMILESO=C1Cc2ccccc2N1CCCCCN1CCN(CC1)c1cccc2ccccc12