Reaction Details
TargetPotassium voltage-gated channel subfamily H member 2
LigandBDBM50277870
Substrate/Competitorn/a
Meas. Tech.ChEMBL_501727 (CHEMBL985007)
Ki 1020±n/a nM
Citation Humphries, PSLafontaine, JAAgree, CSAlexander, DChen, PDo, QQLi, LYLunney, EARajapakse, RJSiegel, KTimofeevski, SLWang, TWilhite, DM Synthesis and SAR of 4-substituted-2-aminopyrimidines as novel c-Jun N-terminal kinase (JNK) inhibitors. Bioorg Med Chem Lett19:2099-102 (2009) 
 
Potassium voltage-gated channel subfamily H member 2
Name:Potassium voltage-gated channel subfamily H member 2
Type:Multi-pass membrane protein
Mol. Mass.:126672.65
Organism:Homo sapiens (Human)
Description:Q12809
Residue:1159
BDBM50277870
NameBDBM50277870
Synonyms:4-(3-(4-chlorophenyl)-1H-pyrazol-4-yl)-N-(1-methylpiperidin-4-yl)pyrimidin-2-amine | CHEMBL450660
TypeSmall organic molecule
Emp. Form.C19H21ClN6
Mol. Mass.368.863
SMILESCN1CCC(CC1)Nc1nccc(n1)-c1c[nH]nc1-c1ccc(Cl)cc1