Reaction Details
TargetCannabinoid receptor 2
LigandBDBM50259047
Substrate/Competitorn/a
Meas. Tech.ChEMBL_499987 (CHEMBL1022899)
EC50 20920±n/a nM
Citation Srivastava, BKSoni, RPatel, JZJoharapurkar, ASadhwani, NKshirsagar, SMishra, BTakale, VGupta, SPandya, PKapadnis, PSolanki, MPatel, HMitra, PJain, MRPatel, PR Hair growth stimulator property of thienyl substituted pyrazole carboxamide derivatives as a CB1 receptor antagonist with in vivo antiobesity effect. Bioorg Med Chem Lett19:2546-50 (2009) 
 
Cannabinoid receptor 2
Name:Cannabinoid receptor 2
Type:G Protein-Coupled Receptor (GPCR)
Mol. Mass.:39690.94
Organism:Homo sapiens (Human)
Description:P34972
Residue:360
BDBM50259047
NameBDBM50259047
Synonyms:5-(5-chlorothiophen-2-yl)-1-(2,4-dichlorophenyl)-4-methyl-N-(pyrrolidin-1-yl)-1H-pyrazole-3-carboxamide | CHEMBL510262
TypeSmall organic molecule
Emp. Form.C19H17Cl3N4OS
Mol. Mass.455.788
SMILESCc1c(nn(c1-c1ccc(Cl)s1)-c1ccc(Cl)cc1Cl)C(=O)NN1CCCC1