Reaction Details
TargetCannabinoid receptor 1
LigandBDBM50259092
Substrate/Competitorn/a
Meas. Tech.ChEMBL_499986 (CHEMBL1022898)
EC50 510±n/a nM
Citation Srivastava, BKSoni, RPatel, JZJoharapurkar, ASadhwani, NKshirsagar, SMishra, BTakale, VGupta, SPandya, PKapadnis, PSolanki, MPatel, HMitra, PJain, MRPatel, PR Hair growth stimulator property of thienyl substituted pyrazole carboxamide derivatives as a CB1 receptor antagonist with in vivo antiobesity effect. Bioorg Med Chem Lett19:2546-50 (2009) 
 
Cannabinoid receptor 1
Name:Cannabinoid receptor 1
Type:G Protein-Coupled Receptor (GPCR)
Mol. Mass.:52868.96
Organism:Homo sapiens (Human)
Description:P21554
Residue:472
BDBM50259092
NameBDBM50259092
Synonyms:5-(5-bromothiophen-2-yl)-1-(2,4-dichlorophenyl)-4-ethyl-N-(piperidin-1-yl)-1H-pyrazole-3-carboxamide | CHEMBL511726
TypeSmall organic molecule
Emp. Form.C21H21BrCl2N4OS
Mol. Mass.528.293
SMILESCCc1c(nn(c1-c1ccc(Br)s1)-c1ccc(Cl)cc1Cl)C(=O)NN1CCCCC1