Reaction Details
TargetCannabinoid receptor 2
LigandBDBM50259093
Substrate/Competitorn/a
Meas. Tech.ChEMBL_499987 (CHEMBL1022899)
EC50 7550±n/a nM
Citation Srivastava, BKSoni, RPatel, JZJoharapurkar, ASadhwani, NKshirsagar, SMishra, BTakale, VGupta, SPandya, PKapadnis, PSolanki, MPatel, HMitra, PJain, MRPatel, PR Hair growth stimulator property of thienyl substituted pyrazole carboxamide derivatives as a CB1 receptor antagonist with in vivo antiobesity effect. Bioorg Med Chem Lett19:2546-50 (2009) 
 
Cannabinoid receptor 2
Name:Cannabinoid receptor 2
Type:G Protein-Coupled Receptor (GPCR)
Mol. Mass.:39690.94
Organism:Homo sapiens (Human)
Description:P34972
Residue:360
BDBM50259093
NameBDBM50259093
Synonyms:1-(2,4-dichlorophenyl)-4-methyl-N-(piperidin-1-yl)-5-(thiophen-2-yl)-1H-pyrazole-3-carboxamide | CHEMBL466521
TypeSmall organic molecule
Emp. Form.C20H20Cl2N4OS
Mol. Mass.435.37
SMILESCc1c(nn(c1-c1cccs1)-c1ccc(Cl)cc1Cl)C(=O)NN1CCCCC1