Reaction Details
TargetCannabinoid receptor 2
LigandBDBM50259139
Substrate/Competitorn/a
Meas. Tech.ChEMBL_500189 (CHEMBL980656)
IC50 8600±n/a nM
Citation Debenham, JSMadsen-Duggan, CBWang, JTong, XLao, JFong, TMSchaeffer, MTXiao, JCHuang, CCShen, CPSloan Stribling, DShearman, LPStrack, AMEuan Macintyre, DHale, JJWalsh, TF Pyridopyrimidine based cannabinoid-1 receptor inverse agonists: Synthesis and biological evaluation. Bioorg Med Chem Lett19:2591-4 (2009) 
 
Cannabinoid receptor 2
Name:Cannabinoid receptor 2
Type:G Protein-Coupled Receptor (GPCR)
Mol. Mass.:39690.94
Organism:Homo sapiens (Human)
Description:P34972
Residue:360
BDBM50259139
NameBDBM50259139
Synonyms:2-tert-butyl-7-(2-chlorophenyl)-6-(4-chlorophenyl)pyrido[2,3-d]pyrimidin-4-ol | CHEMBL466470
TypeSmall organic molecule
Emp. Form.C23H19Cl2N3O
Mol. Mass.424.322
SMILESCC(C)(C)c1nc2nc(-c3ccccc3Cl)c(cc2c(=O)[nH]1)-c1ccc(Cl)cc1