Reaction Details
TargetCannabinoid receptor 1
LigandBDBM50259140
Substrate/Competitorn/a
Meas. Tech.ChEMBL_500188 (CHEMBL980655)
IC50 6±n/a nM
Citation Debenham, JSMadsen-Duggan, CBWang, JTong, XLao, JFong, TMSchaeffer, MTXiao, JCHuang, CCShen, CPSloan Stribling, DShearman, LPStrack, AMEuan Macintyre, DHale, JJWalsh, TF Pyridopyrimidine based cannabinoid-1 receptor inverse agonists: Synthesis and biological evaluation. Bioorg Med Chem Lett19:2591-4 (2009) 
 
Cannabinoid receptor 1
Name:Cannabinoid receptor 1
Type:G Protein-Coupled Receptor (GPCR)
Mol. Mass.:52868.96
Organism:Homo sapiens (Human)
Description:P21554
Residue:472
BDBM50259140
NameBDBM50259140
Synonyms:2-tert-butyl-6-(4-chlorophenyl)-7-(2,4-dichlorophenyl)pyrido[2,3-d]pyrimidin-4(3H)-one CHEMBL512957
TypeSmall organic molecule
Emp. Form.C23H18Cl3N3O
Mol. Mass.458.768
SMILESCC(C)(C)c1nc2nc(-c3ccc(Cl)cc3Cl)c(cc2c(=O)[nH]1)-c1ccc(Cl)cc1