Reaction Details
TargetCannabinoid receptor 2
LigandBDBM50259183
Substrate/Competitorn/a
Meas. Tech.ChEMBL_500189 (CHEMBL980656)
IC50>2000±n/a nM
Citation Debenham, JSMadsen-Duggan, CBWang, JTong, XLao, JFong, TMSchaeffer, MTXiao, JCHuang, CCShen, CPSloan Stribling, DShearman, LPStrack, AMEuan Macintyre, DHale, JJWalsh, TF Pyridopyrimidine based cannabinoid-1 receptor inverse agonists: Synthesis and biological evaluation. Bioorg Med Chem Lett19:2591-4 (2009) 
 
Cannabinoid receptor 2
Name:Cannabinoid receptor 2
Type:G Protein-Coupled Receptor (GPCR)
Mol. Mass.:39690.94
Organism:Homo sapiens (Human)
Description:P34972
Residue:360
BDBM50259183
NameBDBM50259183
Synonyms:7-(2-chlorophenyl)-2,6-bis(4-chlorophenyl)pyrido[2,3-d]pyrimidin-4-ol | CHEMBL511558
TypeSmall organic molecule
Emp. Form.C25H14Cl3N3O
Mol. Mass.478.757
SMILESClc1ccc(cc1)-c1cc2c(nc([nH]c2=O)-c2ccc(Cl)cc2)nc1-c1ccccc1Cl