Reaction Details
TargetCannabinoid receptor 2
LigandBDBM50259184
Substrate/Competitorn/a
Meas. Tech.ChEMBL_500189 (CHEMBL980656)
IC50>2000±n/a nM
Citation Debenham, JSMadsen-Duggan, CBWang, JTong, XLao, JFong, TMSchaeffer, MTXiao, JCHuang, CCShen, CPSloan Stribling, DShearman, LPStrack, AMEuan Macintyre, DHale, JJWalsh, TF Pyridopyrimidine based cannabinoid-1 receptor inverse agonists: Synthesis and biological evaluation. Bioorg Med Chem Lett19:2591-4 (2009) 
 
Cannabinoid receptor 2
Name:Cannabinoid receptor 2
Type:G Protein-Coupled Receptor (GPCR)
Mol. Mass.:39690.94
Organism:Homo sapiens (Human)
Description:P34972
Residue:360
BDBM50259184
NameBDBM50259184
Synonyms:7-(2-chlorophenyl)-2,6-bis(4-chlorophenyl)pyrido[2,3-d]pyrimidin-4-amine | CHEMBL466884
TypeSmall organic molecule
Emp. Form.C25H15Cl3N4
Mol. Mass.477.772
SMILESNc1nc(nc2nc(-c3ccccc3Cl)c(cc12)-c1ccc(Cl)cc1)-c1ccc(Cl)cc1