Reaction Details
TargetCannabinoid receptor 2
LigandBDBM50259338
Substrate/Competitorn/a
Meas. Tech.ChEMBL_500189 (CHEMBL980656)
IC50 9800±n/a nM
Citation Debenham, JSMadsen-Duggan, CBWang, JTong, XLao, JFong, TMSchaeffer, MTXiao, JCHuang, CCShen, CPSloan Stribling, DShearman, LPStrack, AMEuan Macintyre, DHale, JJWalsh, TF Pyridopyrimidine based cannabinoid-1 receptor inverse agonists: Synthesis and biological evaluation. Bioorg Med Chem Lett19:2591-4 (2009) 
 
Cannabinoid receptor 2
Name:Cannabinoid receptor 2
Type:G Protein-Coupled Receptor (GPCR)
Mol. Mass.:39690.94
Organism:Homo sapiens (Human)
Description:P34972
Residue:360
BDBM50259338
NameBDBM50259338
Synonyms:3-((1,2,4-oxadiazol-3-yl)methyl)-7-(2-chlorophenyl)-6-(4-chlorophenyl)-2-isopropylpyrido[2,3-d]pyrimidin-4(3H)-one | CHEMBL466111
TypeSmall organic molecule
Emp. Form.C25H19Cl2N5O2
Mol. Mass.492.357
SMILESCC(C)c1nc2nc(-c3ccccc3Cl)c(cc2c(=O)n1Cc1ncon1)-c1ccc(Cl)cc1