Reaction Details
TargetCannabinoid receptor 2
LigandBDBM50259389
Substrate/Competitorn/a
Meas. Tech.ChEMBL_500189 (CHEMBL980656)
IC50 2700±n/a nM
Citation Debenham, JSMadsen-Duggan, CBWang, JTong, XLao, JFong, TMSchaeffer, MTXiao, JCHuang, CCShen, CPSloan Stribling, DShearman, LPStrack, AMEuan Macintyre, DHale, JJWalsh, TF Pyridopyrimidine based cannabinoid-1 receptor inverse agonists: Synthesis and biological evaluation. Bioorg Med Chem Lett19:2591-4 (2009) 
 
Cannabinoid receptor 2
Name:Cannabinoid receptor 2
Type:G Protein-Coupled Receptor (GPCR)
Mol. Mass.:39690.94
Organism:Homo sapiens (Human)
Description:P34972
Residue:360
BDBM50259389
NameBDBM50259389
Synonyms:5-tert-butyl-8-(2-chlorophenyl)-9-(3-chlorophenyl)pyrido[3,2-e][1,2,4]triazolo[4,3-c]pyrimidin-3(2H)-one | CHEMBL467328
TypeSmall organic molecule
Emp. Form.C24H19Cl2N5O
Mol. Mass.464.347
SMILESCC(C)(C)c1nc2nc(-c3ccccc3Cl)c(cc2c2n[nH]c(=O)n12)-c1cccc(Cl)c1