Reaction Details
TargetCannabinoid receptor 2
LigandBDBM50259390
Substrate/Competitorn/a
Meas. Tech.ChEMBL_500189 (CHEMBL980656)
IC50 18000±n/a nM
Citation Debenham, JSMadsen-Duggan, CBWang, JTong, XLao, JFong, TMSchaeffer, MTXiao, JCHuang, CCShen, CPSloan Stribling, DShearman, LPStrack, AMEuan Macintyre, DHale, JJWalsh, TF Pyridopyrimidine based cannabinoid-1 receptor inverse agonists: Synthesis and biological evaluation. Bioorg Med Chem Lett19:2591-4 (2009) 
 
Cannabinoid receptor 2
Name:Cannabinoid receptor 2
Type:G Protein-Coupled Receptor (GPCR)
Mol. Mass.:39690.94
Organism:Homo sapiens (Human)
Description:P34972
Residue:360
BDBM50259390
NameBDBM50259390
Synonyms:4-(5-tert-butyl-8-(2-chlorophenyl)-3-oxo-2,3-dihydropyrido[3,2-e][1,2,4]triazolo[4,3-c]pyrimidin-9-yl)benzonitrile | CHEMBL512436
TypeSmall organic molecule
Emp. Form.C25H19ClN6O
Mol. Mass.454.911
SMILESCC(C)(C)c1nc2nc(-c3ccccc3Cl)c(cc2c2n[nH]c(=O)n12)-c1ccc(cc1)C#N