Reaction Details
TargetCannabinoid receptor 2
LigandBDBM50259391
Substrate/Competitorn/a
Meas. Tech.ChEMBL_500189 (CHEMBL980656)
IC50 19000±n/a nM
Citation Debenham, JSMadsen-Duggan, CBWang, JTong, XLao, JFong, TMSchaeffer, MTXiao, JCHuang, CCShen, CPSloan Stribling, DShearman, LPStrack, AMEuan Macintyre, DHale, JJWalsh, TF Pyridopyrimidine based cannabinoid-1 receptor inverse agonists: Synthesis and biological evaluation. Bioorg Med Chem Lett19:2591-4 (2009) 
 
Cannabinoid receptor 2
Name:Cannabinoid receptor 2
Type:G Protein-Coupled Receptor (GPCR)
Mol. Mass.:39690.94
Organism:Homo sapiens (Human)
Description:P34972
Residue:360
BDBM50259391
NameBDBM50259391
Synonyms:4-(5-tert-butyl-9-(4-chlorophenyl)-3-oxo-2,3-dihydropyrido[3,2-e][1,2,4]triazolo[4,3-c]pyrimidin-8-yl)-3-chlorobenzonitrile | CHEMBL467329
TypeSmall organic molecule
Emp. Form.C25H18Cl2N6O
Mol. Mass.489.356
SMILESCC(C)(C)c1nc2nc(-c3ccc(cc3Cl)C#N)c(cc2c2n[nH]c(=O)n12)-c1ccc(Cl)cc1