Reaction Details
TargetCannabinoid receptor 2
LigandBDBM50259494
Substrate/Competitorn/a
Meas. Tech.ChEMBL_500189 (CHEMBL980656)
IC50 770±n/a nM
Citation Debenham, JSMadsen-Duggan, CBWang, JTong, XLao, JFong, TMSchaeffer, MTXiao, JCHuang, CCShen, CPSloan Stribling, DShearman, LPStrack, AMEuan Macintyre, DHale, JJWalsh, TF Pyridopyrimidine based cannabinoid-1 receptor inverse agonists: Synthesis and biological evaluation. Bioorg Med Chem Lett19:2591-4 (2009) 
 
Cannabinoid receptor 2
Name:Cannabinoid receptor 2
Type:G Protein-Coupled Receptor (GPCR)
Mol. Mass.:39690.94
Organism:Homo sapiens (Human)
Description:P34972
Residue:360
BDBM50259494
NameBDBM50259494
Synonyms:5-tert-butyl-8-(2-chlorophenyl)-9-(4-(dimethylamino)phenyl)pyrido[3,2-e][1,2,4]triazolo[4,3-c]pyrimidin-3(2H)-one | CHEMBL467917
TypeSmall organic molecule
Emp. Form.C26H25ClN6O
Mol. Mass.472.969
SMILESCN(C)c1ccc(cc1)-c1cc2c3n[nH]c(=O)n3c(nc2nc1-c1ccccc1Cl)C(C)(C)C