Reaction Details
TargetCannabinoid receptor 1
LigandBDBM50176435
Substrate/Competitorn/a
Meas. Tech.ChEMBL_500187 (CHEMBL980654)
IC50 7.5±n/a nM
Citation Debenham, JSMadsen-Duggan, CBWang, JTong, XLao, JFong, TMSchaeffer, MTXiao, JCHuang, CCShen, CPSloan Stribling, DShearman, LPStrack, AMEuan Macintyre, DHale, JJWalsh, TF Pyridopyrimidine based cannabinoid-1 receptor inverse agonists: Synthesis and biological evaluation. Bioorg Med Chem Lett19:2591-4 (2009) 
 
Cannabinoid receptor 1
Name:Cannabinoid receptor 1
Type:G Protein-Coupled Receptor (GPCR)
Mol. Mass.:52868.96
Organism:Homo sapiens (Human)
Description:P21554
Residue:472
BDBM50176435
NameBDBM50176435
Synonyms:CHEMBL204232 Naphthyridinone
TypeSmall organic molecule
Emp. Form.C25H18Cl3N3O3
Mol. Mass.514.788
SMILESCC(=O)Nc1c(C(C)=O)c(=O)n(C)c2nc(-c3ccc(Cl)cc3Cl)c(cc12)-c1ccc(Cl)cc1