Reaction Details
Target5-hydroxytryptamine receptor 2A
LigandBDBM50277957
Substrate/Competitorn/a
Meas. Tech.ChEMBL_497613 (CHEMBL1002099)
Ki 323±n/a nM
Citation Duplantier, AJEfremov, ICandler, JDoran, ACGanong, AHHaas, JAHanks, ANKraus, KGLazzaro, JTLu, JMaklad, NMcCarthy, SAO'Sullivan, TJRogers, BNSiuciak, JASpracklin, DKZhang, L 3-Benzyl-1,3-oxazolidin-2-ones as mGluR2 positive allosteric modulators: Hit-to lead and lead optimization. Bioorg Med Chem Lett19:2524-9 (2009) 
 
5-hydroxytryptamine receptor 2A
Name:5-hydroxytryptamine receptor 2A
Type:undefined
Mol. Mass.:52607.65
Organism:Homo sapiens (Human)
Description:P28223
Residue:471
BDBM50277957
NameBDBM50277957
Synonyms:(R)-3-((2',4'-difluorobiphenyl-4-yl)methyl)-5-methyloxazolidin-2-one | CHEMBL483751
TypeSmall organic molecule
Emp. Form.C17H15F2NO2
Mol. Mass.303.3033
SMILESC[C@@H]1CN(Cc2ccc(cc2)-c2ccc(F)cc2F)C(=O)O1