Reaction Details
Target5-hydroxytryptamine receptor 5A
LigandBDBM50267556
Substrate/Competitorn/a
Meas. Tech.ChEMBL_563491 (CHEMBL961039)
Ki>10000±n/a nM
Citation Herth, MMKramer, VPiel, MPalner, MRiss, PJKnudsen, GMRösch, F Synthesis and in vitro affinities of various MDL 100907 derivatives as potential 18F-radioligands for 5-HT2A receptor imaging with PET. Bioorg Med Chem17:2989-3002 (2009) 
 
5-hydroxytryptamine receptor 5A
Name:5-hydroxytryptamine receptor 5A
Type:Enzyme
Mol. Mass.:40266.25
Organism:Homo sapiens (Human)
Description:P47898
Residue:357
BDBM50267556
NameBDBM50267556
Synonyms:4-(3-(2-Fluoroethoxy)-2-methoxy-benzoyl)-1-(2-pnitrophenylethyl)-piperidine | CHEMBL490634
TypeSmall organic molecule
Emp. Form.C23H27FN2O5
Mol. Mass.430.4693
SMILESCOc1c(OCCF)cccc1C(=O)C1CCN(CCc2ccc(cc2)[N+]([O-])=O)CC1