Reaction Details
TargetAlpha-2C adrenergic receptor
LigandBDBM50232152
Substrate/Competitorn/a
Meas. Tech.ChEMBL_563479 (CHEMBL961027)
Ki 148±n/a nM
Citation Herth, MMKramer, VPiel, MPalner, MRiss, PJKnudsen, GMRösch, F Synthesis and in vitro affinities of various MDL 100907 derivatives as potential 18F-radioligands for 5-HT2A receptor imaging with PET. Bioorg Med Chem17:2989-3002 (2009) 
 
Alpha-2C adrenergic receptor
Name:Alpha-2C adrenergic receptor
Type:Enzyme
Mol. Mass.:49552.32
Organism:Homo sapiens (Human)
Description:P18825
Residue:462
BDBM50232152
NameBDBM50232152
Synonyms:(1-(4-fluorophenethyl)piperidin-4-yl)(3-(2-fluoroethoxy)-2-methoxyphenyl)methanol CHEMBL402143
TypeSmall organic molecule
Emp. Form.C23H29F2NO3
Mol. Mass.405.4781
SMILESCOc1c(OCCF)cccc1C(O)C1CCN(CCc2ccc(F)cc2)CC1