Reaction Details
Target5-hydroxytryptamine receptor 2A
LigandBDBM50113332
Substrate/Competitorn/a
Meas. Tech.ChEMBL_563476 (CHEMBL961024)
Ki 0.72±n/a nM
Citation Herth, MMKramer, VPiel, MPalner, MRiss, PJKnudsen, GMRösch, F Synthesis and in vitro affinities of various MDL 100907 derivatives as potential 18F-radioligands for 5-HT2A receptor imaging with PET. Bioorg Med Chem17:2989-3002 (2009) 
 
5-hydroxytryptamine receptor 2A
Name:5-hydroxytryptamine receptor 2A
Type:G Protein-Coupled Receptor (GPCR)
Mol. Mass.:52852.05
Organism:Rattus norvegicus (rat)
Description:Rat cortex membranes 5-HT2A receptors.
Residue:471
BDBM50113332
NameBDBM50113332
Synonyms:3-(2-(4-(4-fluorobenzoyl)piperidin-1-yl)ethyl)-2-thioxo-2,3-dihydroquinazolin-4(1H)-one CHEMBL62919 | altanserin
TypeSmall organic molecule
Emp. Form.C22H22FN3O2S
Mol. Mass.411.492
SMILESFc1ccc(cc1)C(=O)C1CCN(CCn2c(=S)[nH]c3ccccc3c2=O)CC1