Reaction Details
Target5-hydroxytryptamine receptor 1A
LigandBDBM50267557
Substrate/Competitorn/a
Meas. Tech.ChEMBL_563474 (CHEMBL961022)
Ki 991±n/a nM
Citation Herth, MMKramer, VPiel, MPalner, MRiss, PJKnudsen, GMRösch, F Synthesis and in vitro affinities of various MDL 100907 derivatives as potential 18F-radioligands for 5-HT2A receptor imaging with PET. Bioorg Med Chem17:2989-3002 (2009) 
 
5-hydroxytryptamine receptor 1A
Name:5-hydroxytryptamine receptor 1A
Type:n/a
Mol. Mass.:46122.49
Organism:Homo sapiens (Human)
Description:n/a
Residue:422
BDBM50267557
NameBDBM50267557
Synonyms:4-(3-(2-Fluoroethoxy)-2-methoxy-benzoyl)-1-(2-pmethoxyphenylethyl)-piperidine | CHEMBL489408
TypeSmall organic molecule
Emp. Form.C24H30FNO4
Mol. Mass.415.4977
SMILESCOc1ccc(CCN2CCC(CC2)C(=O)c2cccc(OCCF)c2OC)cc1