Reaction Details
Target5-hydroxytryptamine receptor 2A
LigandBDBM50267598
Substrate/Competitorn/a
Meas. Tech.ChEMBL_563476 (CHEMBL961024)
Ki 1.24±n/a nM
Citation Herth, MMKramer, VPiel, MPalner, MRiss, PJKnudsen, GMRösch, F Synthesis and in vitro affinities of various MDL 100907 derivatives as potential 18F-radioligands for 5-HT2A receptor imaging with PET. Bioorg Med Chem17:2989-3002 (2009) 
 
5-hydroxytryptamine receptor 2A
Name:5-hydroxytryptamine receptor 2A
Type:G Protein-Coupled Receptor (GPCR)
Mol. Mass.:52852.05
Organism:Rattus norvegicus (rat)
Description:Rat cortex membranes 5-HT2A receptors.
Residue:471
BDBM50267598
NameBDBM50267598
Synonyms:(3-Hydroxy-2-methoxyphenyl)-(1-(2-p-fluorophenylethyl)-piperidine-4-yl)-methanol | CHEMBL490847
TypeSmall organic molecule
Emp. Form.C21H26FNO3
Mol. Mass.359.4344
SMILESCOc1c(O)cccc1C(O)C1CCN(CCc2ccc(F)cc2)CC1