Reaction Details
Target5-hydroxytryptamine receptor 1B
LigandBDBM50232152
Substrate/Competitorn/a
Meas. Tech.ChEMBL_563475 (CHEMBL961023)
Ki 1846±n/a nM
Citation Herth, MMKramer, VPiel, MPalner, MRiss, PJKnudsen, GMRösch, F Synthesis and in vitro affinities of various MDL 100907 derivatives as potential 18F-radioligands for 5-HT2A receptor imaging with PET. Bioorg Med Chem17:2989-3002 (2009) 
 
5-hydroxytryptamine receptor 1B
Name:5-hydroxytryptamine receptor 1B
Type:G Protein-Coupled Receptor (GPCR)
Mol. Mass.:43579.17
Organism:Homo sapiens (Human)
Description:Receptor binding assays were performed using human clone stably expressed in CHO cells
Residue:390
BDBM50232152
NameBDBM50232152
Synonyms:(1-(4-fluorophenethyl)piperidin-4-yl)(3-(2-fluoroethoxy)-2-methoxyphenyl)methanol CHEMBL402143
TypeSmall organic molecule
Emp. Form.C23H29F2NO3
Mol. Mass.405.4781
SMILESCOc1c(OCCF)cccc1C(O)C1CCN(CCc2ccc(F)cc2)CC1