Reaction Details
Target5-hydroxytryptamine receptor 1E
LigandBDBM50267509
Substrate/Competitorn/a
Meas. Tech.ChEMBL_563488 (CHEMBL961036)
Ki>10000±n/a nM
Citation Herth, MMKramer, VPiel, MPalner, MRiss, PJKnudsen, GMRösch, F Synthesis and in vitro affinities of various MDL 100907 derivatives as potential 18F-radioligands for 5-HT2A receptor imaging with PET. Bioorg Med Chem17:2989-3002 (2009) 
 
5-hydroxytryptamine receptor 1E
Name:5-hydroxytryptamine receptor 1E
Type:G Protein-Coupled Receptor (GPCR)
Mol. Mass.:41697.80
Organism:Homo sapiens (Human)
Description:gi_112822
Residue:365
BDBM50267509
NameBDBM50267509
Synonyms:(3-(2-Fluorethoxy)-2-methoxyphenyl)-(1-(2-p-nitrophenylethyl)-piperidine-4-yl)-methanol | CHEMBL476838
TypeSmall organic molecule
Emp. Form.C23H29FN2O5
Mol. Mass.432.4852
SMILESCOc1c(OCCF)cccc1C(O)C1CCN(CCc2ccc(cc2)[N+]([O-])=O)CC1