Reaction Details
TargetD(1B) dopamine receptor
LigandBDBM50267507
Substrate/Competitorn/a
Meas. Tech.ChEMBL_563496 (CHEMBL961044)
Ki 7419±n/a nM
Citation Herth, MMKramer, VPiel, MPalner, MRiss, PJKnudsen, GMRösch, F Synthesis and in vitro affinities of various MDL 100907 derivatives as potential 18F-radioligands for 5-HT2A receptor imaging with PET. Bioorg Med Chem17:2989-3002 (2009) 
 
D(1B) dopamine receptor
Name:D(1B) dopamine receptor
Type:Protein
Mol. Mass.:52943.41
Organism:Homo sapiens (Human)
Description:P21918
Residue:477
BDBM50267507
NameBDBM50267507
Synonyms:(R)-(3-(2-Fluoroethoxy)-2-methoxyphenyl)-(1-(2-p-fluorophenylethyl)-piperidine-4-yl)-methanol | CHEMBL515472
TypeSmall organic molecule
Emp. Form.C23H29F2NO3
Mol. Mass.405.4781
SMILESCOc1c(OCCF)cccc1[C@H](O)C1CCN(CCc2ccc(F)cc2)CC1