Reaction Details
TargetBeta-3 adrenergic receptor
LigandBDBM50232152
Substrate/Competitorn/a
Meas. Tech.ChEMBL_563497 (CHEMBL961045)
Ki>10000±n/a nM
Citation Herth, MMKramer, VPiel, MPalner, MRiss, PJKnudsen, GMRösch, F Synthesis and in vitro affinities of various MDL 100907 derivatives as potential 18F-radioligands for 5-HT2A receptor imaging with PET. Bioorg Med Chem17:2989-3002 (2009) 
 
Beta-3 adrenergic receptor
Name:Beta-3 adrenergic receptor
Type:G Protein-Coupled Receptor (GPCR)
Mol. Mass.:43534.88
Organism:Homo sapiens (Human)
Description:n/a
Residue:408
BDBM50232152
NameBDBM50232152
Synonyms:(1-(4-fluorophenethyl)piperidin-4-yl)(3-(2-fluoroethoxy)-2-methoxyphenyl)methanol CHEMBL402143
TypeSmall organic molecule
Emp. Form.C23H29F2NO3
Mol. Mass.405.4781
SMILESCOc1c(OCCF)cccc1C(O)C1CCN(CCc2ccc(F)cc2)CC1