Reaction Details
TargetCannabinoid receptor 1
LigandBDBM50267799
Substrate/Competitorn/a
Meas. Tech.ChEMBL_563541 (CHEMBL961828)
Ki 2820±n/a nM
Citation Brizzi, ABrizzi, VCascio, MGCorelli, FGuida, FLigresti, AMaione, SMartinelli, APasquini, STuccinardi, TDi Marzo, V New resorcinol-anandamide"hybrids" as potent cannabinoid receptor ligands endowed with antinociceptive activity in vivo. J Med Chem52:2506-14 (2009) 
 
Cannabinoid receptor 1
Name:Cannabinoid receptor 1
Type:G Protein-Coupled Receptor (GPCR)
Mol. Mass.:52868.96
Organism:Homo sapiens (Human)
Description:P21554
Residue:472
BDBM50267799
NameBDBM50267799
Synonyms:CHEMBL519043 | N-(4-hydroxy-3-methoxybenzyl)-11-(3-hydroxy-5-(2-methyloctan-2-yl)phenoxy)undecanamide
TypeSmall organic molecule
Emp. Form.C34H53NO5
Mol. Mass.555.7883
SMILESCCCCCCC(C)(C)c1cc(O)cc(OCCCCCCCCCCC(=O)NCc2ccc(O)c(OC)c2)c1