Reaction Details
TargetCannabinoid receptor 2
LigandBDBM50267799
Substrate/Competitorn/a
Meas. Tech.ChEMBL_563542 (CHEMBL961829)
Ki 510±n/a nM
Citation Brizzi, ABrizzi, VCascio, MGCorelli, FGuida, FLigresti, AMaione, SMartinelli, APasquini, STuccinardi, TDi Marzo, V New resorcinol-anandamide"hybrids" as potent cannabinoid receptor ligands endowed with antinociceptive activity in vivo. J Med Chem52:2506-14 (2009) 
 
Cannabinoid receptor 2
Name:Cannabinoid receptor 2
Type:G Protein-Coupled Receptor (GPCR)
Mol. Mass.:39690.94
Organism:Homo sapiens (Human)
Description:P34972
Residue:360
BDBM50267799
NameBDBM50267799
Synonyms:CHEMBL519043 | N-(4-hydroxy-3-methoxybenzyl)-11-(3-hydroxy-5-(2-methyloctan-2-yl)phenoxy)undecanamide
TypeSmall organic molecule
Emp. Form.C34H53NO5
Mol. Mass.555.7883
SMILESCCCCCCC(C)(C)c1cc(O)cc(OCCCCCCCCCCC(=O)NCc2ccc(O)c(OC)c2)c1