Reaction Details
TargetCannabinoid receptor 1
LigandBDBM50267637
Substrate/Competitorn/a
Meas. Tech.ChEMBL_563547 (CHEMBL961834)
IC50>10000±n/a nM
Citation Brizzi, ABrizzi, VCascio, MGCorelli, FGuida, FLigresti, AMaione, SMartinelli, APasquini, STuccinardi, TDi Marzo, V New resorcinol-anandamide"hybrids" as potent cannabinoid receptor ligands endowed with antinociceptive activity in vivo. J Med Chem52:2506-14 (2009) 
 
Cannabinoid receptor 1
Name:Cannabinoid receptor 1
Type:G Protein-Coupled Receptor (GPCR)
Mol. Mass.:52856.55
Organism:Rattus norvegicus (rat)
Description:P20272
Residue:473
BDBM50267637
NameBDBM50267637
Synonyms:11-(3,5-Dihydroxyphenoxy)undecanoic Acid (2-Hydroxyethyl)amide | CHEMBL489835
TypeSmall organic molecule
Emp. Form.C19H31NO5
Mol. Mass.353.4531
SMILESOCCNC(=O)CCCCCCCCCCOc1cc(O)cc(O)c1