Reaction Details
TargetCannabinoid receptor 2
LigandBDBM50267670
Substrate/Competitorn/a
Meas. Tech.ChEMBL_563549 (CHEMBL961836)
IC50>10000±n/a nM
Citation Brizzi, ABrizzi, VCascio, MGCorelli, FGuida, FLigresti, AMaione, SMartinelli, APasquini, STuccinardi, TDi Marzo, V New resorcinol-anandamide"hybrids" as potent cannabinoid receptor ligands endowed with antinociceptive activity in vivo. J Med Chem52:2506-14 (2009) 
 
Cannabinoid receptor 2
Name:Cannabinoid receptor 2
Type:Enzyme
Mol. Mass.:39366.68
Organism:Rattus norvegicus (Rat)
Description:Q9QZN9
Residue:360
BDBM50267670
NameBDBM50267670
Synonyms:CHEMBL490046 | N-cyclopropyl-11-(3,5-dihydroxyphenoxy)undecanamide
TypeSmall organic molecule
Emp. Form.C20H31NO4
Mol. Mass.349.4644
SMILESOc1cc(O)cc(OCCCCCCCCCCC(=O)NC2CC2)c1