Reaction Details
TargetCannabinoid receptor 1
LigandBDBM50267672
Substrate/Competitorn/a
Meas. Tech.ChEMBL_563541 (CHEMBL961828)
Ki 2220±n/a nM
Citation Brizzi, ABrizzi, VCascio, MGCorelli, FGuida, FLigresti, AMaione, SMartinelli, APasquini, STuccinardi, TDi Marzo, V New resorcinol-anandamide"hybrids" as potent cannabinoid receptor ligands endowed with antinociceptive activity in vivo. J Med Chem52:2506-14 (2009) 
 
Cannabinoid receptor 1
Name:Cannabinoid receptor 1
Type:G Protein-Coupled Receptor (GPCR)
Mol. Mass.:52868.96
Organism:Homo sapiens (Human)
Description:P21554
Residue:472
BDBM50267672
NameBDBM50267672
Synonyms:CHEMBL490246 | N-cyclopropyl-11-(3-(heptyloxy)-5-hydroxyphenoxy)undecanamide
TypeSmall organic molecule
Emp. Form.C27H45NO4
Mol. Mass.447.6505
SMILESCCCCCCCOc1cc(O)cc(OCCCCCCCCCCC(=O)NC2CC2)c1