Reaction Details
TargetCannabinoid receptor 1
LigandBDBM50267711
Substrate/Competitorn/a
Meas. Tech.ChEMBL_563541 (CHEMBL961828)
Ki 20±n/a nM
Citation Brizzi, ABrizzi, VCascio, MGCorelli, FGuida, FLigresti, AMaione, SMartinelli, APasquini, STuccinardi, TDi Marzo, V New resorcinol-anandamide"hybrids" as potent cannabinoid receptor ligands endowed with antinociceptive activity in vivo. J Med Chem52:2506-14 (2009) 
 
Cannabinoid receptor 1
Name:Cannabinoid receptor 1
Type:G Protein-Coupled Receptor (GPCR)
Mol. Mass.:52868.96
Organism:Homo sapiens (Human)
Description:P21554
Residue:472
BDBM50267711
NameBDBM50267711
Synonyms:CHEMBL489251 | N-cyclopropyl-11-(3-hydroxy-5-(2-methyloctan-2-yl)phenoxy)undecanamide
TypeSmall organic molecule
Emp. Form.C29H49NO3
Mol. Mass.459.7043
SMILESCCCCCCC(C)(C)c1cc(O)cc(OCCCCCCCCCCC(=O)NC2CC2)c1