Reaction Details
TargetNeuronal acetylcholine receptor subunit alpha-7
LigandBDBM50267844
Substrate/Competitorn/a
Meas. Tech.ChEMBL_563559 (CHEMBL961846)
Ki 1995.26±n/a nM
Citation Ulens, CAkdemir, AJongejan, Avan Elk, RBertrand, SPerrakis, ALeurs, RSmit, ABSixma, TKBertrand, Dde Esch, IJ Use of acetylcholine binding protein in the search for novel alpha7 nicotinic receptor ligands. In silico docking, pharmacological screening, and X-ray analysis. J Med Chem52:2372-83 (2009) 
 
Neuronal acetylcholine receptor subunit alpha-7
Name:Neuronal acetylcholine receptor subunit alpha-7
Type:n/a
Mol. Mass.:56448.33
Organism:Homo sapiens (Human)
Description: CHRNA7 (NACHRA7)
Residue:502
BDBM50267844
NameBDBM50267844
Synonyms:3-(10,11-Dihydro-5H-dibenzo[a,d]cyclohepten-5-yloxy)-8,8-dimethyl-8-azonia-bicyclo[3.2.1]octane | CHEMBL490843
TypeSmall organic molecule
Emp. Form.C24H30NO
Mol. Mass.348.5006
SMILESC[N+]1(C)C2CCC1CC(C2)OC1c2ccccc2CCc2ccccc12