Reaction Details
TargetAcetylcholine-binding protein
LigandBDBM50413519
Substrate/Competitorn/a
Meas. Tech.ChEMBL_563557 (CHEMBL961844)
Ki 316.23±n/a nM
Citation Ulens, CAkdemir, AJongejan, Avan Elk, RBertrand, SPerrakis, ALeurs, RSmit, ABSixma, TKBertrand, Dde Esch, IJ Use of acetylcholine binding protein in the search for novel alpha7 nicotinic receptor ligands. In silico docking, pharmacological screening, and X-ray analysis. J Med Chem52:2372-83 (2009) 
 
Acetylcholine-binding protein
Name:Acetylcholine-binding protein
Type:n/a
Mol. Mass.:26055.52
Organism:Lymnaea stagnalis
Description:Soluble acetylcholine receptor
Residue:229
BDBM50413519
NameBDBM50413519
Synonyms:CHEMBL491860
TypeSmall organic molecule
Emp. Form.C24H29NO
Mol. Mass.347.4932
SMILESCN1C2CCC1CC(C2)OC1c2ccccc2CCc2c(C)cccc12