Reaction Details
TargetMu-type opioid receptor
LigandBDBM50259098
Substrate/Competitorn/a
Meas. Tech.ChEMBL_500501 (CHEMBL1009678)
EC50 540±n/a nM
Citation Yang, SWHo, GTulshian, DGreenlee, WJTan, ZZhang, HSmith-Torhan, AFawzi, AAnthes, JLu, SVarty, GFernandez, XMcLeod, RLHey, J Identification of 3-substituted N-benzhydryl-nortropane analogs as nociceptin receptor ligands for the management of cough and anxiety. Bioorg Med Chem Lett19:2482-6 (2009) 
 
Mu-type opioid receptor
Name:Mu-type opioid receptor
Type:G Protein-Coupled Receptor (GPCR)
Mol. Mass.:44789.51
Organism:Homo sapiens (Human)
Description:P35372
Residue:400
BDBM50259098
NameBDBM50259098
Synonyms:CHEMBL3084526 | endo-8-(bis(2-chlorophenyl)methyl)-3-(4-fluorobenzyl)-8-azabicyclo[3.2.1]octane-3-carboxamide
TypeSmall organic molecule
Emp. Form.C28H27Cl2FN2O
Mol. Mass.497.431
SMILES[H][C@]12CC[C@]([H])(C[C@@](Cc3ccc(F)cc3)(C1)C(N)=O)N2C(c1ccccc1Cl)c1ccccc1Cl