Reaction Details
TargetNociceptin receptor
LigandBDBM50259512
Substrate/Competitorn/a
Meas. Tech.ChEMBL_500498 (CHEMBL1009675)
Ki 961±n/a nM
Citation Yang, SWHo, GTulshian, DGreenlee, WJTan, ZZhang, HSmith-Torhan, AFawzi, AAnthes, JLu, SVarty, GFernandez, XMcLeod, RLHey, J Identification of 3-substituted N-benzhydryl-nortropane analogs as nociceptin receptor ligands for the management of cough and anxiety. Bioorg Med Chem Lett19:2482-6 (2009) 
 
Nociceptin receptor
Name:Nociceptin receptor
Type:G Protein-Coupled Receptor (GPCR)
Mol. Mass.:40702.87
Organism:Homo sapiens (Human)
Description:P41146
Residue:370
BDBM50259512
NameBDBM50259512
Synonyms:CHEMBL3084552 | endo-methyl 8-(bis(2-chlorophenyl)methyl)-3-(5-chloropyridin-2-yl)-8-azabicyclo[3.2.1]octan-3-ylcarbamate
TypeSmall organic molecule
Emp. Form.C27H26Cl3N3O2
Mol. Mass.530.873
SMILES[H][C@]12CC[C@]([H])(C[C@](C1)(NC(=O)OC)c1ccc(Cl)cn1)N2C(c1ccccc1Cl)c1ccccc1Cl