Reaction Details
TargetNociceptin receptor
LigandBDBM50259549
Substrate/Competitorn/a
Meas. Tech.ChEMBL_500498 (CHEMBL1009675)
Ki 190±n/a nM
Citation Yang, SWHo, GTulshian, DGreenlee, WJTan, ZZhang, HSmith-Torhan, AFawzi, AAnthes, JLu, SVarty, GFernandez, XMcLeod, RLHey, J Identification of 3-substituted N-benzhydryl-nortropane analogs as nociceptin receptor ligands for the management of cough and anxiety. Bioorg Med Chem Lett19:2482-6 (2009) 
 
Nociceptin receptor
Name:Nociceptin receptor
Type:G Protein-Coupled Receptor (GPCR)
Mol. Mass.:40702.87
Organism:Homo sapiens (Human)
Description:P41146
Residue:370
BDBM50259549
NameBDBM50259549
Synonyms:CHEMBL3084555 | endo-2-(8-(bis(2-chlorophenyl)methyl)-3-(4-fluorobenzyl)-8-azabicyclo[3.2.1]octan-3-yl)acetamide
TypeSmall organic molecule
Emp. Form.C29H29Cl2FN2O
Mol. Mass.511.458
SMILES[H][C@]12CC[C@]([H])(C[C@](CC(N)=O)(Cc3ccc(F)cc3)C1)N2C(c1ccccc1Cl)c1ccccc1Cl