Reaction Details
TargetNociceptin receptor
LigandBDBM50259551
Substrate/Competitorn/a
Meas. Tech.ChEMBL_500498 (CHEMBL1009675)
Ki 447±n/a nM
Citation Yang, SWHo, GTulshian, DGreenlee, WJTan, ZZhang, HSmith-Torhan, AFawzi, AAnthes, JLu, SVarty, GFernandez, XMcLeod, RLHey, J Identification of 3-substituted N-benzhydryl-nortropane analogs as nociceptin receptor ligands for the management of cough and anxiety. Bioorg Med Chem Lett19:2482-6 (2009) 
 
Nociceptin receptor
Name:Nociceptin receptor
Type:G Protein-Coupled Receptor (GPCR)
Mol. Mass.:40702.87
Organism:Homo sapiens (Human)
Description:P41146
Residue:370
BDBM50259551
NameBDBM50259551
Synonyms:CHEMBL3084557 | endo-8-(bis(2-chlorophenyl)methyl)-3-(4-chlorobenzyl)-8-azabicyclo[3.2.1]octan-3-amine
TypeSmall organic molecule
Emp. Form.C27H27Cl3N2
Mol. Mass.485.876
SMILES[H][C@]12CC[C@]([H])(C[C@](N)(Cc3ccc(Cl)cc3)C1)N2C(c1ccccc1Cl)c1ccccc1Cl