Reaction Details
TargetNociceptin receptor
LigandBDBM50259581
Substrate/Competitorn/a
Meas. Tech.ChEMBL_500498 (CHEMBL1009675)
Ki 46.0±n/a nM
Citation Yang, SWHo, GTulshian, DGreenlee, WJTan, ZZhang, HSmith-Torhan, AFawzi, AAnthes, JLu, SVarty, GFernandez, XMcLeod, RLHey, J Identification of 3-substituted N-benzhydryl-nortropane analogs as nociceptin receptor ligands for the management of cough and anxiety. Bioorg Med Chem Lett19:2482-6 (2009) 
 
Nociceptin receptor
Name:Nociceptin receptor
Type:G Protein-Coupled Receptor (GPCR)
Mol. Mass.:40702.87
Organism:Homo sapiens (Human)
Description:P41146
Residue:370
BDBM50259581
NameBDBM50259581
Synonyms:CHEMBL3084561 | endo-8-(bis(2-chlorophenyl)methyl)-3-(6-bromopyridin-3-yl)-8-azabicyclo[3.2.1]octane-3-carboxamide
TypeSmall organic molecule
Emp. Form.C26H24BrCl2N3O
Mol. Mass.545.298
SMILES[H][C@]12CC[C@]([H])(C[C@](C1)(C(N)=O)c1ccc(Br)nc1)N2C(c1ccccc1Cl)c1ccccc1Cl