Reaction Details
TargetNociceptin receptor
LigandBDBM50259582
Substrate/Competitorn/a
Meas. Tech.ChEMBL_500498 (CHEMBL1009675)
Ki 17±n/a nM
Citation Yang, SWHo, GTulshian, DGreenlee, WJTan, ZZhang, HSmith-Torhan, AFawzi, AAnthes, JLu, SVarty, GFernandez, XMcLeod, RLHey, J Identification of 3-substituted N-benzhydryl-nortropane analogs as nociceptin receptor ligands for the management of cough and anxiety. Bioorg Med Chem Lett19:2482-6 (2009) 
 
Nociceptin receptor
Name:Nociceptin receptor
Type:G Protein-Coupled Receptor (GPCR)
Mol. Mass.:40702.87
Organism:Homo sapiens (Human)
Description:P41146
Residue:370
BDBM50259582
NameBDBM50259582
Synonyms:CHEMBL512962 | endo-8-(bis(2-chlorophenyl)methyl)-3-(piperidin-2-yl)-8-azabicyclo[3.2.1]octane-3-carboxamide
TypeSmall organic molecule
Emp. Form.C26H31Cl2N3O
Mol. Mass.472.45
SMILESNC(=O)C1(C[C@H]2CC[C@H](C1)N2C(c1ccccc1Cl)c1ccccc1Cl)C1CCCCN1