Reaction Details
TargetNociceptin receptor
LigandBDBM50259552
Substrate/Competitorn/a
Meas. Tech.ChEMBL_500499 (CHEMBL1009676)
EC50 1560±n/a nM
Citation Yang, SWHo, GTulshian, DGreenlee, WJTan, ZZhang, HSmith-Torhan, AFawzi, AAnthes, JLu, SVarty, GFernandez, XMcLeod, RLHey, J Identification of 3-substituted N-benzhydryl-nortropane analogs as nociceptin receptor ligands for the management of cough and anxiety. Bioorg Med Chem Lett19:2482-6 (2009) 
 
Nociceptin receptor
Name:Nociceptin receptor
Type:G Protein-Coupled Receptor (GPCR)
Mol. Mass.:40702.87
Organism:Homo sapiens (Human)
Description:P41146
Residue:370
BDBM50259552
NameBDBM50259552
Synonyms:CHEMBL3084558 | endo-methyl 8-(bis(2-chlorophenyl)methyl)-3-(4-chlorobenzyl)-8-azabicyclo[3.2.1]octan-3-ylcarbamate
TypeSmall organic molecule
Emp. Form.C29H29Cl3N2O2
Mol. Mass.543.912
SMILES[H][C@]12CC[C@]([H])(C[C@](Cc3ccc(Cl)cc3)(C1)NC(=O)OC)N2C(c1ccccc1Cl)c1ccccc1Cl