Reaction Details
TargetMu-type opioid receptor
LigandBDBM50259144
Substrate/Competitorn/a
Meas. Tech.ChEMBL_500501 (CHEMBL1009678)
EC50 421±n/a nM
Citation Yang, SWHo, GTulshian, DGreenlee, WJTan, ZZhang, HSmith-Torhan, AFawzi, AAnthes, JLu, SVarty, GFernandez, XMcLeod, RLHey, J Identification of 3-substituted N-benzhydryl-nortropane analogs as nociceptin receptor ligands for the management of cough and anxiety. Bioorg Med Chem Lett19:2482-6 (2009) 
 
Mu-type opioid receptor
Name:Mu-type opioid receptor
Type:G Protein-Coupled Receptor (GPCR)
Mol. Mass.:44789.51
Organism:Homo sapiens (Human)
Description:P35372
Residue:400
BDBM50259144
NameBDBM50259144
Synonyms:8-(bis(2-chlorophenyl)methyl)-3-(5-bromopyridin-2-yl)-8-azabicyclo[3.2.1]octane-3-carboxamide | CHEMBL3084531
TypeSmall organic molecule
Emp. Form.C26H24BrCl2N3O
Mol. Mass.545.298
SMILES[H][C@]12CC[C@]([H])(C[C@](C1)(C(N)=O)c1ccc(Br)cn1)N2C(c1ccccc1Cl)c1ccccc1Cl