Reaction Details
TargetSignal transducer and activator of transcription 3
LigandBDBM50267458
Substrate/Competitorn/a
Meas. Tech.ChEMBL_563598 (CHEMBL962551)
IC50 233±n/a nM
Citation Mandal, PKLimbrick, DColeman, DRDyer, GARen, ZBirtwistle, JSXiong, CChen, XBriggs, JMMcMurray, JS Conformationally constrained peptidomimetic inhibitors of signal transducer and activator of transcription. 3: Evaluation and molecular modeling. J Med Chem52:2429-42 (2009) 
 
Signal transducer and activator of transcription 3
Name:Signal transducer and activator of transcription 3
Type:Protein
Mol. Mass.:88064.31
Organism:Homo sapiens (Human)
Description:P40763
Residue:770
BDBM50267458
NameBDBM50267458
Synonyms:4-(3-((3S,6S)-6-((S)-1,5-diamino-1,5-dioxopentan-2-ylcarbamoyl)-4-oxo-1,2,3,4,6,7-hexahydroazepino[3,2,1-hi]indol-3-ylamino)-3-oxoprop-1-enyl)phenyl dihydrogen phosphate | CHEMBL449511
TypeSmall organic molecule
Emp. Form.C27H30N5O9P
Mol. Mass.599.529
SMILESNC(=O)CC[C@H](NC(=O)[C@@H]1Cc2cccc3CC[C@H](NC(=O)\C=C\c4ccc(OP(O)(O)=O)cc4)C(=O)N1c23)C(N)=O