Reaction Details
TargetSignal transducer and activator of transcription 3
LigandBDBM50267460
Substrate/Competitorn/a
Meas. Tech.ChEMBL_563598 (CHEMBL962551)
IC50 305±n/a nM
Citation Mandal, PKLimbrick, DColeman, DRDyer, GARen, ZBirtwistle, JSXiong, CChen, XBriggs, JMMcMurray, JS Conformationally constrained peptidomimetic inhibitors of signal transducer and activator of transcription. 3: Evaluation and molecular modeling. J Med Chem52:2429-42 (2009) 
 
Signal transducer and activator of transcription 3
Name:Signal transducer and activator of transcription 3
Type:Protein
Mol. Mass.:88064.31
Organism:Homo sapiens (Human)
Description:P40763
Residue:770
BDBM50267460
NameBDBM50267460
Synonyms:4-(3-((3S,6S)-6-((S)-5-amino-1-(isopropylamino)-1,5-dioxopentan-2-ylcarbamoyl)-4-oxo-1,2,3,4,6,7-hexahydroazepino[3,2,1-hi]indol-3-ylamino)-3-oxoprop-1-enyl)phenyl dihydrogen phosphate | CHEMBL447460
TypeSmall organic molecule
Emp. Form.C30H36N5O9P
Mol. Mass.641.6087
SMILESCC(C)NC(=O)[C@H](CCC(N)=O)NC(=O)[C@@H]1Cc2cccc3CC[C@H](NC(=O)\C=C\c4ccc(OP(O)(O)=O)cc4)C(=O)N1c23