Reaction Details
TargetCyclin-dependent kinase 3
LigandBDBM50267523
Substrate/Competitorn/a
Meas. Tech.ChEMBL_563644 (CHEMBL963379)
IC50 25100±n/a nM
Citation Gaisina, INGallier, FOugolkov, AVKim, KHKurome, TGuo, SHolzle, DLuchini, DNBlond, SYBilladeau, DDKozikowski, AP From a natural product lead to the identification of potent and selective benzofuran-3-yl-(indol-3-yl)maleimides as glycogen synthase kinase 3beta inhibitors that suppress proliferation and survival of pancreatic cancer cells. J Med Chem52:1853-63 (2009) 
 
Cyclin-dependent kinase 3
Name:Cyclin-dependent kinase 3
Type:Enzyme
Mol. Mass.:35053.88
Organism:Homo sapiens (Human)
Description:Q00526
Residue:305
BDBM50267523
NameBDBM50267523
Synonyms:3-(6-Chloro-5-fluoro-1-methyl-1H-indol-3-yl)-4-(6-hydroxymethylbenzofuran-3-yl)pyrrole-2,5-dione | CHEMBL522590
TypeSmall organic molecule
Emp. Form.C22H14ClFN2O4
Mol. Mass.424.809
SMILESCn1cc(C2=C(C(=O)NC2=O)c2coc3cc(CO)ccc23)c2cc(F)c(Cl)cc12