Reaction Details
TargetGlycogen synthase kinase-3 beta
LigandBDBM50267607
Substrate/Competitorn/a
Meas. Tech.ChEMBL_563639 (CHEMBL963374)
IC50 0.510000±n/a nM
Citation Gaisina, INGallier, FOugolkov, AVKim, KHKurome, TGuo, SHolzle, DLuchini, DNBlond, SYBilladeau, DDKozikowski, AP From a natural product lead to the identification of potent and selective benzofuran-3-yl-(indol-3-yl)maleimides as glycogen synthase kinase 3beta inhibitors that suppress proliferation and survival of pancreatic cancer cells. J Med Chem52:1853-63 (2009) 
 
Glycogen synthase kinase-3 beta
Name:Glycogen synthase kinase-3 beta
Type:Enzyme
Mol. Mass.:46756.38
Organism:Homo sapiens (Human)
Description:P49841
Residue:420
BDBM50267607
NameBDBM50267607
Synonyms:3-(5-Bromo-1-methyl-1H-indol-3-yl)-4-(6-hydroxymethylbenzofuran-3-yl)pyrrole-2,5-dione | CHEMBL489833
TypeSmall organic molecule
Emp. Form.C22H15BrN2O4
Mol. Mass.451.27
SMILESCn1cc(C2=C(C(=O)NC2=O)c2coc3cc(CO)ccc23)c2cc(Br)ccc12