Reaction Details
TargetGlycogen synthase kinase-3 beta
LigandBDBM50267715
Substrate/Competitorn/a
Meas. Tech.ChEMBL_563639 (CHEMBL963374)
IC50 16±n/a nM
Citation Gaisina, INGallier, FOugolkov, AVKim, KHKurome, TGuo, SHolzle, DLuchini, DNBlond, SYBilladeau, DDKozikowski, AP From a natural product lead to the identification of potent and selective benzofuran-3-yl-(indol-3-yl)maleimides as glycogen synthase kinase 3beta inhibitors that suppress proliferation and survival of pancreatic cancer cells. J Med Chem52:1853-63 (2009) 
 
Glycogen synthase kinase-3 beta
Name:Glycogen synthase kinase-3 beta
Type:Enzyme
Mol. Mass.:46756.38
Organism:Homo sapiens (Human)
Description:P49841
Residue:420
BDBM50267715
NameBDBM50267715
Synonyms:3-(5-Cyclopropylethynyl-1-methyl-1H-indol-3-yl)-4-(5-fluorobenzofuran-3-yl)pyrrole-2,5-dione | CHEMBL484685
TypeSmall organic molecule
Emp. Form.C26H17FN2O3
Mol. Mass.424.4232
SMILESCn1cc(C2=C(C(=O)NC2=O)c2coc3ccc(F)cc23)c2cc(ccc12)C#CC1CC1