Reaction Details
TargetGlycogen synthase kinase-3 beta
LigandBDBM50267760
Substrate/Competitorn/a
Meas. Tech.ChEMBL_563639 (CHEMBL963374)
IC50 0.230000±n/a nM
Citation Gaisina, INGallier, FOugolkov, AVKim, KHKurome, TGuo, SHolzle, DLuchini, DNBlond, SYBilladeau, DDKozikowski, AP From a natural product lead to the identification of potent and selective benzofuran-3-yl-(indol-3-yl)maleimides as glycogen synthase kinase 3beta inhibitors that suppress proliferation and survival of pancreatic cancer cells. J Med Chem52:1853-63 (2009) 
 
Glycogen synthase kinase-3 beta
Name:Glycogen synthase kinase-3 beta
Type:Enzyme
Mol. Mass.:46756.38
Organism:Homo sapiens (Human)
Description:P49841
Residue:420
BDBM50267760
NameBDBM50267760
Synonyms:3-Benzofuran-3-yl-4-(7-methoxymethyl-1-methyl-1H-indol-3-yl)pyrrole-2,5-dione | CHEMBL491647
TypeSmall organic molecule
Emp. Form.C23H18N2O4
Mol. Mass.386.4
SMILESCOCc1cccc2c(cn(C)c12)C1=C(C(=O)NC1=O)c1coc2ccccc12